BDBM50164486 CHEMBL3797897
SMILES CCNC(=O)c1c(C)sc2nc(Cn3nc(cc3C3CC3)C(F)(F)F)cc(=O)n12
InChI Key InChIKey=MIFIGKKOLBGYQV-UHFFFAOYSA-N
Data  2 EC50
  Tab Delimited (TSV)   2D SDfile   Computed 3D by Vconf -m prep SDfile
Find this compound or compounds like it in BindingDB:
Activity Spreadsheet -- Enzyme Inhibition Constant Data from BindingDB
Found 1 hit for monomerid = 50164486
TargetGlutamate receptor ionotropic, NMDA 1/2A(Homo sapiens (Human))
Pharmaron-Beijing
Curated by ChEMBL
LigandPNGBDBM50164486(CHEMBL3797897)
Affinity DataEC50:  536nM. Assay description: Positive allosteric modulation of GluN1/GluN2A NMDAR (unknown origin) expressed in Dox-inducible cells measured every 5 mins by BD calcium indicator ...
In DepthDetails ArticlePubMed